#1 2017-08-28 06:42:52

wac1104
Member
Registered: 2017-08-25
Posts: 17

install fpcupdeluxe cross -compiler found error

errorinfo:
:\fpcupdeluxe\fpcbootstrap\make.exe: *** [build-stamp.x86_64-linux] Error 2
fpcupdeluxe: ERROR: FPCCrossInstaller (BuildModuleCustom: FPC): Running cross compiler fpc make all for x86_64-linux failed with an error code.
fpcupdeluxe: ERROR: FPCCrossInstaller (BuildModuleCustom: FPC): Error running !
fpcupdeluxe: ERROR: Sequencer (FPCBuildOnly): Failure running fpcupdeluxe: error executing sequence FPCBuildOnly; line: 2, param: FPC
fpcupdeluxe: ERROR: Sequencer (Only): Failure running fpcupdeluxe: error executing sequence Only; line: 2, param: FPCBuildOnly


ERROR: Fpcupdeluxe fatal error !
Building cross-tools failed ... ??? ... aborting.

Offline

#2 2017-08-28 06:46:31

ab
Administrator
From: France
Registered: 2010-06-21
Posts: 11,695
Website

Re: install fpcupdeluxe cross -compiler found error

Use the FPC/Lazarus forum for these kind of questions, not this forum:
http://forum.lazarus.freepascal.org/ind … 645.0.html

Offline

Board footer

Powered by FluxBB